BDBM370815 US10239835, Example 00366
SMILES [H][C@@]1(C[C@]2([H])CN(C[C@H](O)c3ccc(O)cn3)C[C@]2([H])C1)Oc1ccccc1F
InChI Key InChIKey=NEFQLCKWVRZEJA-ZDXGLAPJSA-N
Data  1 IC50
  Tab Delimited (TSV)   2D SDfile   Computed 3D by Vconf -m prep SDfile
Find this compound or compounds like it in BindingDB:
Activity Spreadsheet -- Enzyme Inhibition Constant Data from BindingDB
Found 1 hit for monomerid = 370815
TargetGlutamate receptor ionotropic, NMDA 1/2B(Homo sapiens (Human))
Cadent Therapeutics
US Patent
LigandPNGBDBM370815(US10239835, Example 00366)
Affinity DataIC50:  8.30nM. Assay description: Cell Culture and plating: HEK293 cells expressing NR1/NR2B (Chantest, Cleveland, Ohio) were grown to 70-80% confluency as an adherent monolayer in st...
In DepthDetails US Patent