BDBM371295 N-(1-Cyanocyclopropyl)-1-[(4-fluorophenyl)methyl]-3-[(2-methylthiazol-5-yl)methyl]-2,4-dioxo-quinazoline-6-sulfonamide::US10239843, Example 402
SMILES Cc1ncc(Cn2c(=O)n(Cc3ccc(F)cc3)c3ccc(cc3c2=O)S(=O)(=O)NC2(CC2)C#N)s1
InChI Key InChIKey=USASBYZFSZMEJN-UHFFFAOYSA-N
Data  1 IC50
  Tab Delimited (TSV)   2D SDfile   Computed 3D by Vconf -m prep SDfile
Find this compound or compounds like it in BindingDB:
Activity Spreadsheet -- Enzyme Inhibition Constant Data from BindingDB
Found 1 hit for monomerid = 371295
TargetPoly(ADP-ribose) glycohydrolase(Homo sapiens (Human))
Cancer Research Technology
US Patent
LigandPNGBDBM371295(N-(1-Cyanocyclopropyl)-1-[(4-fluorophenyl)methyl]-...)
Affinity DataIC50:  66nM. Assay description: PARG In vitro assays were conducted in a total volume of 15 ul in a standard 384 well format. 5 ul of Human Full Length PARG (Produced internally by ...
Ligand InfoPC cidPC sid
In DepthDetails US Patent