BDBM371453 N-[1-(Fluoromethyl)cyclopropyl]-3-[(1-methylpyrazol-4-yl)methyl]-1-[(2-methyl-1,2,4-triazol-3-yl)methyl]-2,4-dioxo-quinazoline-6-sulfonamide::US10239843, Example 562
SMILES Cn1cc(Cn2c(=O)n(Cc3ncnn3C)c3ccc(cc3c2=O)S(=O)(=O)NC2(CF)CC2)cn1
InChI Key InChIKey=APNOAYSWDNEQMZ-UHFFFAOYSA-N
Data  1 IC50
  Tab Delimited (TSV)   2D SDfile   Computed 3D by Vconf -m prep SDfile
Find this compound or compounds like it in BindingDB:
Activity Spreadsheet -- Enzyme Inhibition Constant Data from BindingDB
Found 1 hit for monomerid = 371453
TargetPoly(ADP-ribose) glycohydrolase(Homo sapiens (Human))
Cancer Research Technology
US Patent
LigandPNGBDBM371453(N-[1-(Fluoromethyl)cyclopropyl]-3-[(1-methylpyrazo...)
Affinity DataIC50:  192nM. Assay description: PARG In vitro assays were conducted in a total volume of 15 ul in a standard 384 well format. 5 ul of Human Full Length PARG (Produced internally by ...
Ligand InfoPC cidPC sid
In DepthDetails US Patent