BDBM371501 1-[2-(Diethylamino)ethyl]-N-[1-(fluoromethyl)cyclopropyl]-3-[(1-methylpyrazol-4-yl)methyl]-2,4-dioxo-quinazoline-6-sulfonamide::US10239843, Example 611
SMILES CCN(CC)CCn1c2ccc(cc2c(=O)n(Cc2cnn(C)c2)c1=O)S(=O)(=O)NC1(CF)CC1
InChI Key InChIKey=CSXOBMWZJNPDJS-UHFFFAOYSA-N
Data  1 IC50
  Tab Delimited (TSV)   2D SDfile   Computed 3D by Vconf -m prep SDfile
Find this compound or compounds like it in BindingDB:
Activity Spreadsheet -- Enzyme Inhibition Constant Data from BindingDB
Found 1 hit for monomerid = 371501
TargetPoly(ADP-ribose) glycohydrolase(Homo sapiens (Human))
Cancer Research Technology
US Patent
LigandPNGBDBM371501(1-[2-(Diethylamino)ethyl]-N-[1-(fluoromethyl)cyclo...)
Affinity DataIC50:  113nM. Assay description: PARG In vitro assays were conducted in a total volume of 15 ul in a standard 384 well format. 5 ul of Human Full Length PARG (Produced internally by ...
Ligand InfoPC cidPC sid
In DepthDetails US Patent