BDBM37166 MLS000116412::N-[1-(3,4-dichlorobenzyl)-3,5-dimethyl-pyrazol-4-yl]-5-isobutyl-isoxazole-3-carboxamide::N-[1-[(3,4-dichlorophenyl)methyl]-3,5-dimethyl-4-pyrazolyl]-5-(2-methylpropyl)-3-isoxazolecarboxamide::N-[1-[(3,4-dichlorophenyl)methyl]-3,5-dimethyl-pyrazol-4-yl]-5-(2-methylpropyl)-1,2-oxazole-3-carboxamide::N-[1-[(3,4-dichlorophenyl)methyl]-3,5-dimethylpyrazol-4-yl]-5-(2-methylpropyl)-1,2-oxazole-3-carboxamide::SMR000093389::cid_5308125
SMILES CC(C)Cc1cc(no1)C(=O)Nc1c(C)nn(Cc2ccc(Cl)c(Cl)c2)c1C
InChI Key InChIKey=XBXPQKCYCQFVCK-UHFFFAOYSA-N
Data  4 EC50
  Tab Delimited (TSV)   2D SDfile   Computed 3D by Vconf -m prep SDfile
Find this compound or compounds like it in BindingDB:
Activity Spreadsheet -- Enzyme Inhibition Constant Data from BindingDB
Found 4 hits for monomerid = 37166
TargetSphingosine 1-phosphate receptor 1(Homo sapiens (Human))
The Scripps Research Institute Molecular Screening Center
Curated by PubChem BioAssay
LigandPNGBDBM37166(MLS000116412 | N-[1-(3,4-dichlorobenzyl)-3,5-dimet...)
Affinity DataEC50:  9.38E+3nM. Assay description: Source (MLSCN Center Name): The Scripps Research Institute Molecular Screening Center Center Affiliation: The Scripps Research Institute, TSRI Assay ...
In DepthDetails PCBioAssay
TargetVoltage-dependent T-type calcium channel subunit alpha-1H(Homo sapiens (Human))
Vanderbilt Screening Center For Gpcrs, Ion Channels And Transporters
Curated by PubChem BioAssay
LigandPNGBDBM37166(MLS000116412 | N-[1-(3,4-dichlorobenzyl)-3,5-dimet...)
Affinity DataEC50:  1.28E+3nM. Assay description: Assay Provider: Xinmin Xie Assay Provider Affiliation: Bioscience Division, SRI International, Menlo Park, CA Grant Title: HTS Assay for Cav3 T-Type ...
In DepthDetails PCBioAssay
TargetSphingosine 1-phosphate receptor 1(Homo sapiens (Human))
The Scripps Research Institute Molecular Screening Center
Curated by PubChem BioAssay
LigandPNGBDBM37166(MLS000116412 | N-[1-(3,4-dichlorobenzyl)-3,5-dimet...)
Affinity DataEC50:  9.16E+3nM. Assay description: Source (MLSCN Center Name): The Scripps Research Institute Molecular Screening Center Center Affiliation: The Scripps Research Institute, TSRI Assay ...
In DepthDetails PCBioAssay
TargetSphingosine 1-phosphate receptor 1(Homo sapiens (Human))
The Scripps Research Institute Molecular Screening Center
Curated by PubChem BioAssay
LigandPNGBDBM37166(MLS000116412 | N-[1-(3,4-dichlorobenzyl)-3,5-dimet...)
Affinity DataEC50:  2.38E+4nM. Assay description: Source (MLSCN Center Name): The Scripps Research Institute Molecular Screening Center Center Affiliation: The Scripps Research Institute, TSRI Assay ...
In DepthDetails PCBioAssay