BDBM37174 MLS000120226::SMR000097143::[4-(2,3-dimethylphenyl)-1-piperazinyl]-[5-[(4-methoxyphenyl)sulfonylmethyl]-2-furanyl]methanone::[4-(2,3-dimethylphenyl)piperazin-1-yl]-[5-[(4-methoxyphenyl)sulfonylmethyl]furan-2-yl]methanone::[4-(2,3-dimethylphenyl)piperazino]-[5-[(4-methoxyphenyl)sulfonylmethyl]-2-furyl]methanone::cid_4092553
SMILES COc1ccc(cc1)S(=O)(=O)Cc1ccc(o1)C(=O)N1CCN(CC1)c1cccc(C)c1C
InChI Key InChIKey=PDNWQTIPSVDUJE-UHFFFAOYSA-N
Data  3 EC50
  Tab Delimited (TSV)   2D SDfile   Computed 3D by Vconf -m prep SDfile
Find this compound or compounds like it in BindingDB:
Activity Spreadsheet -- Enzyme Inhibition Constant Data from BindingDB
Found 3 hits for monomerid = 37174
TargetSphingosine 1-phosphate receptor 1(Homo sapiens (Human))
The Scripps Research Institute Molecular Screening Center
Curated by PubChem BioAssay
LigandPNGBDBM37174(MLS000120226 | SMR000097143 | [4-(2,3-dimethylphen...)
Affinity DataEC50: >3.00E+4nM. Assay description: Source (MLSCN Center Name): The Scripps Research Institute Molecular Screening Center Center Affiliation: The Scripps Research Institute, TSRI Assay ...
In DepthDetails PCBioAssay
TargetSphingosine 1-phosphate receptor 1(Homo sapiens (Human))
The Scripps Research Institute Molecular Screening Center
Curated by PubChem BioAssay
LigandPNGBDBM37174(MLS000120226 | SMR000097143 | [4-(2,3-dimethylphen...)
Affinity DataEC50:  1.40E+4nM. Assay description: Source (MLSCN Center Name): The Scripps Research Institute Molecular Screening Center Center Affiliation: The Scripps Research Institute, TSRI Assay ...
In DepthDetails PCBioAssay
TargetSphingosine 1-phosphate receptor 1(Homo sapiens (Human))
The Scripps Research Institute Molecular Screening Center
Curated by PubChem BioAssay
LigandPNGBDBM37174(MLS000120226 | SMR000097143 | [4-(2,3-dimethylphen...)
Affinity DataEC50: >3.00E+4nM. Assay description: Source (MLSCN Center Name): The Scripps Research Institute Molecular Screening Center Center Affiliation: The Scripps Research Institute, TSRI Assay ...
In DepthDetails PCBioAssay