BDBM372631 N-[2-(3-Fluoro-4-trifluoromethoxy-benzyl)-2H-[1,2,3]triazol-4-yl]-2-[4-(1-trifluoromethyl-cyclopropyl)-phenyl]-acetamide::US10246426, Example 188
SMILES Fc1cc(Cn2ncc(NC(=O)Cc3ccc(cc3)C3(CC3)C(F)(F)F)n2)ccc1OC(F)(F)F
InChI Key InChIKey=BDFZJSICPBQMIS-UHFFFAOYSA-N
Data  1 IC50
  Tab Delimited (TSV)   2D SDfile   Computed 3D by Vconf -m prep SDfile
Find this compound or compounds like it in BindingDB:
Activity Spreadsheet -- Enzyme Inhibition Constant Data from BindingDB
Found 1 hit for monomerid = 372631
TargetVoltage-dependent T-type calcium channel subunit alpha-1H(Homo sapiens (Human))
Idorsia Pharmaceuticals
US Patent
LigandPNGBDBM372631(N-[2-(3-Fluoro-4-trifluoromethoxy-benzyl)-2H-[1,2,...)
Affinity DataIC50:  96nM. Assay description: Stock solutions of test compounds are prepared to a concentration of 10 mM in DMSO. For the Cav3.2 assay, serial dilutions of the compounds are prepa...
Ligand InfoPC cidPC sid
In DepthDetails US Patent