BDBM373143 FD-2013015::US9902709, Compound Example 1
SMILES Cn1cc(cn1)-c1nccc(Oc2ccc(NC(=O)Nc3ccc(Cl)c(c3)C(F)(F)F)cc2)c1F
InChI Key InChIKey=BGPGTOPPJADJBC-UHFFFAOYSA-N
Data  1 IC50
  Tab Delimited (TSV)   2D SDfile   Computed 3D by Vconf -m prep SDfile
Find this compound or compounds like it in BindingDB:
Activity Spreadsheet -- Enzyme Inhibition Constant Data from BindingDB
Found 1 hit for monomerid = 373143
TargetVascular endothelial growth factor receptor 2(Homo sapiens (Human))
Peking University Founder Group
US Patent
LigandPNGBDBM373143(FD-2013015 | US9902709, Compound Example 1)
Affinity DataIC50:  28.6nM. Assay description: Kinase Enzymatic step assay Control (10 μL) Sample Negative Positive Compound 4 μL 4 μL 2.5% 4 μL 2.5% DMSO/kinase DMSO/kinase bu...
Ligand InfoPC cidPC sid
In DepthDetails US Patent