BDBM373544 1-[6-(2,6-Dimethyl-phenoxy)-7-fluoro-4-phenylamino-quinazolin-2-yl]-1H-pyrazole-4-carboxylic acid;::US10246442, Example 6::US10975062, Example 6
SMILES Cc1cccc(C)c1Oc1cc2c(Nc3ccccc3)nc(nc2cc1F)-n1cc(cn1)C(O)=O
InChI Key InChIKey=BHNPWIFUKKKCIZ-UHFFFAOYSA-N
Data  2 IC50
  Tab Delimited (TSV)   2D SDfile   Computed 3D by Vconf -m prep SDfile
Find this compound or compounds like it in BindingDB:
Activity Spreadsheet -- Enzyme Inhibition Constant Data from BindingDB
Found 2 hits for monomerid = 373544
TargetEgl nine homolog 1 [181-417](Homo sapiens (Human))
TBA
US Patent
LigandPNGBDBM373544(1-[6-(2,6-Dimethyl-phenoxy)-7-fluoro-4-phenylamino...)
Affinity DataIC50:  39.8nM. Assay description: The PHD enzymatic assay was performed in 0.5 ml of reaction mixture containing the following: purified PHD2181-417 polypeptide (3 μg), synthetic...
Ligand InfoPC cidPC sid
In DepthDetails US Patent
TargetEgl nine homolog 1 [182-426](Homo sapiens (Human))
Janssen Pharmaceutica
US Patent
LigandPNGBDBM373544(1-[6-(2,6-Dimethyl-phenoxy)-7-fluoro-4-phenylamino...)
Affinity DataIC50:  39.8nM. Assay description: The PHD enzymatic assay was performed in 0.5 ml of reaction mixture containing the following: purified PHD2181-417 polypeptide (3 μg), synthetic...
Ligand InfoPC cidPC sid
In DepthDetails US Patent