BDBM374208 US10246456, Example 348::US10577367, Example 348
SMILES CCC[C@H](N)c1cccc(n1)-c1cc(N2CC(C2)C(O)=O)c2cnn(-c3cccc(CO)n3)c2c1
InChI Key InChIKey=BXZQMOJGXJTPCN-FQEVSTJZSA-N
Data  2 IC50  1 EC50
  Tab Delimited (TSV)   2D SDfile   Computed 3D by Vconf -m prep SDfile
Find this compound or compounds like it in BindingDB:
Activity Spreadsheet -- Enzyme Inhibition Constant Data from BindingDB
Found 3 hits for monomerid = 374208
TargetInterleukin-1 receptor-associated kinase 4(Homo sapiens (Human))
Biogen Ma
US Patent
LigandPNGBDBM374208(US10246456, Example 348 | US10577367, Example 348)
Affinity DataIC50: <100nM. Assay description: The biochemical assay is in a AlphaScreen format. The kinase reaction is based on the IRAK-4 phosphorylation of a biotin labeled peptide. The phospho...
Ligand InfoPC cidPC sid
In DepthDetails US Patent
TargetInterleukin-1 receptor-associated kinase 4(Homo sapiens (Human))
Biogen Ma
US Patent
LigandPNGBDBM374208(US10246456, Example 348 | US10577367, Example 348)
Affinity DataIC50: <100nM. Assay description: The biochemical assay is in a AlphaScreen format. The kinase reaction is based on the IRAK-4 phosphorylation of a biotin labeled peptide. The phospho...
Ligand InfoPC cidPC sid
In DepthDetails US Patent
TargetInterleukin-1 receptor-associated kinase 4(Homo sapiens (Human))
Biogen Ma
US Patent
LigandPNGBDBM374208(US10246456, Example 348 | US10577367, Example 348)
Affinity DataEC50: <1.00E+3nM. Assay description: The cell-based assays is based on IL-6 ELISA quantification. Briefly, A549 cells are cultured in DMEM with 10% FBS medium. When cells reach 80% confl...
Ligand InfoPC cidPC sid
In DepthDetails US Patent