BDBM375241 US10253018, Example 7
SMILES CC(C)Oc1nc2ccc(cc2nc1N1CCOCC1)C(=O)Nc1cccc(n1)-c1nncn1C(C)C
InChI Key InChIKey=KQZFWTWBAAHTOK-UHFFFAOYSA-N
Data  1 IC50
  Tab Delimited (TSV)   2D SDfile   Computed 3D by Vconf -m prep SDfile
Find this compound or compounds like it in BindingDB:
Activity Spreadsheet -- Enzyme Inhibition Constant Data from BindingDB
Found 1 hit for monomerid = 375241
TargetMitogen-activated protein kinase kinase kinase 5(Homo sapiens (Human))
Enanta Pharmaceuticals
US Patent
LigandPNGBDBM375241(US10253018, Example 7)
Affinity DataIC50:  550nM. Assay description: ASK1 was purchased from Thermofisher (Catalogue # PV4011), ATP was purchased from Sigma (Catalogue # A7699), HTRF® KinEASE™ Assay System was obtained...
Ligand InfoPC cidPC sid
In DepthDetails US Patent