BDBM37671 2-(3-bromanyl-5-methoxy-4-oxidanyl-phenyl)-3-(furan-2-ylcarbonyl)-1-(5-methyl-1,2-oxazol-3-yl)-4-oxidanyl-2H-pyrrol-5-one::2-(3-bromo-4-hydroxy-5-methoxyphenyl)-3-(furan-2-carbonyl)-4-hydroxy-1-(5-methyl-1,2-oxazol-3-yl)-2H-pyrrol-5-one::2-(3-bromo-4-hydroxy-5-methoxyphenyl)-3-[2-furanyl(oxo)methyl]-4-hydroxy-1-(5-methyl-3-isoxazolyl)-2H-pyrrol-5-one::5-(3-bromo-4-hydroxy-5-methoxy-phenyl)-4-(2-furoyl)-3-hydroxy-1-(5-methylisoxazol-3-yl)-3-pyrrolin-2-one::MLS000082281::SMR000047006::cid_665729
SMILES COc1cc(cc(Br)c1O)C1C(C(=O)c2ccco2)C(=O)C(=O)N1c1cc(C)on1
InChI Key InChIKey=WHELBDIVNQHAAJ-UHFFFAOYSA-N
Data  2 KI  2 IC50  1 EC50
  Tab Delimited (TSV)   2D SDfile   Computed 3D by Vconf -m prep SDfile
Find this compound or compounds like it in BindingDB:
Activity Spreadsheet -- Enzyme Inhibition Constant Data from BindingDB
Found 5 hits for monomerid = 37671
TargetfMet-Leu-Phe receptor(Homo sapiens (Human))
Nmmlsc
Curated by PubChem BioAssay
LigandPNGBDBM37671(2-(3-bromanyl-5-methoxy-4-oxidanyl-phenyl)-3-(fura...)
Affinity DataKi:  3.12E+4nM. Assay description: University of New Mexico Assay Overview: Assay Support: NIH 1R03MH076381-01 Assay for Formylpeptide Receptor Family Ligands PI: Bruce S. Edwards, Ph...
In DepthDetails PCBioAssay
TargetN-formyl peptide receptor 2(Homo sapiens (Human))
Nmmlsc
Curated by PubChem BioAssay
LigandPNGBDBM37671(2-(3-bromanyl-5-methoxy-4-oxidanyl-phenyl)-3-(fura...)
Affinity DataKi: >4.03E+4nM. Assay description: University of New Mexico Assay Overview Assay Support: NIH 1R03MH076381-01 Assay for Formylpeptide Receptor Family Ligands PI: Bruce S. Edwards, Ph....
In DepthDetails PCBioAssay
TargetCorticotropin-releasing factor-binding protein(Homo sapiens (Human))
Burnham Center For Chemical Genomics
Curated by PubChem BioAssay
LigandPNGBDBM37671(2-(3-bromanyl-5-methoxy-4-oxidanyl-phenyl)-3-(fura...)
Affinity DataEC50: >5.30E+4nM. Assay description: Data Source: Sanford-Burnham Center for Chemical Genomics (SBCCG) Source Affiliation: Sanford-Burnham Medical Research Institute (SBMRI, San Diego, C...
In DepthDetails PCBioAssay
TargetfMet-Leu-Phe receptor(Homo sapiens (Human))
Nmmlsc
Curated by PubChem BioAssay
LigandPNGBDBM37671(2-(3-bromanyl-5-methoxy-4-oxidanyl-phenyl)-3-(fura...)
Affinity DataIC50:  4.77E+4nM. Assay description: University of New Mexico Assay Overview: Assay Support: NIH 1R03MH076381-01 Assay for Formylpeptide Receptor Family Ligands PI: Bruce S. Edwards, Ph...
In DepthDetails PCBioAssay
TargetN-formyl peptide receptor 2(Homo sapiens (Human))
Nmmlsc
Curated by PubChem BioAssay
LigandPNGBDBM37671(2-(3-bromanyl-5-methoxy-4-oxidanyl-phenyl)-3-(fura...)
Affinity DataIC50: >6.67E+4nM. Assay description: University of New Mexico Assay Overview Assay Support: NIH 1R03MH076381-01 Assay for Formylpeptide Receptor Family Ligands PI: Bruce S. Edwards, Ph....
In DepthDetails PCBioAssay