BDBM37731 2-(6-amino-5-cyano-4-cyclohex-2-en-1-yl-2,4-dihydropyrano[2,3-c]pyrazol-3-yl)acetic acid methyl ester::2-[6-amino-5-cyano-4-(1-cyclohex-2-enyl)-2,4-dihydropyrano[2,3-c]pyrazol-3-yl]acetic acid methyl ester::MLS000043507::SMR000020324::cid_3242657::methyl (6-amino-5-cyano-4-cyclohex-2-en-1-yl-2,4-dihydropyrano[2,3-c]pyrazol-3-yl)acetate::methyl 2-(6-amino-5-cyano-4-cyclohex-2-en-1-yl-2,4-dihydropyrano[2,3-c]pyrazol-3-yl)acetate::methyl 2-(6-azanyl-5-cyano-4-cyclohex-2-en-1-yl-2,4-dihydropyrano[2,3-c]pyrazol-3-yl)ethanoate
SMILES COC(=O)Cc1n[nH]c2OC(=N)C(C#N)C(C3CCCC=C3)c12
InChI Key InChIKey=BRPDROSHKGEUPU-UHFFFAOYSA-N
Data  2 KI  2 IC50
  Tab Delimited (TSV)   2D SDfile   Computed 3D by Vconf -m prep SDfile
Find this compound or compounds like it in BindingDB:
Activity Spreadsheet -- Enzyme Inhibition Constant Data from BindingDB
Found 4 hits for monomerid = 37731
TargetN-formyl peptide receptor 2(Homo sapiens (Human))
Nmmlsc
Curated by PubChem BioAssay
LigandPNGBDBM37731(2-(6-amino-5-cyano-4-cyclohex-2-en-1-yl-2,4-dihydr...)
Affinity DataKi: >4.03E+4nM. Assay description: University of New Mexico Assay Overview Assay Support: NIH 1R03MH076381-01 Assay for Formylpeptide Receptor Family Ligands PI: Bruce S. Edwards, Ph....
In DepthDetails PCBioAssay
TargetfMet-Leu-Phe receptor(Homo sapiens (Human))
Nmmlsc
Curated by PubChem BioAssay
LigandPNGBDBM37731(2-(6-amino-5-cyano-4-cyclohex-2-en-1-yl-2,4-dihydr...)
Affinity DataKi: >4.37E+4nM. Assay description: University of New Mexico Assay Overview: Assay Support: NIH 1R03MH076381-01 Assay for Formylpeptide Receptor Family Ligands PI: Bruce S. Edwards, Ph...
In DepthDetails PCBioAssay
TargetN-formyl peptide receptor 2(Homo sapiens (Human))
Nmmlsc
Curated by PubChem BioAssay
LigandPNGBDBM37731(2-(6-amino-5-cyano-4-cyclohex-2-en-1-yl-2,4-dihydr...)
Affinity DataIC50: >6.67E+4nM. Assay description: University of New Mexico Assay Overview Assay Support: NIH 1R03MH076381-01 Assay for Formylpeptide Receptor Family Ligands PI: Bruce S. Edwards, Ph....
In DepthDetails PCBioAssay
TargetfMet-Leu-Phe receptor(Homo sapiens (Human))
Nmmlsc
Curated by PubChem BioAssay
LigandPNGBDBM37731(2-(6-amino-5-cyano-4-cyclohex-2-en-1-yl-2,4-dihydr...)
Affinity DataIC50: >6.67E+4nM. Assay description: University of New Mexico Assay Overview: Assay Support: NIH 1R03MH076381-01 Assay for Formylpeptide Receptor Family Ligands PI: Bruce S. Edwards, Ph...
In DepthDetails PCBioAssay