BDBM377553 US10266493, Example 2PP::US10919858, Example 2PP
SMILES CC(C)(Sc1ccncc1-c1ccncc1)C(O)=O
InChI Key InChIKey=XIYXNBSPACSWJR-UHFFFAOYSA-N
Data  2 EC50
  Tab Delimited (TSV)   2D SDfile   Computed 3D by Vconf -m prep SDfile
Find this compound or compounds like it in BindingDB:
Activity Spreadsheet -- Enzyme Inhibition Constant Data from BindingDB
Found 2 hits for monomerid = 377553
TargetSolute carrier family 22 member 12(Homo sapiens (Human))
Ardea Biosciences
US Patent
LigandPNGBDBM377553(US10266493, Example 2PP | US10919858, Example 2PP)
Affinity DataEC50:  25nM. Assay description: HEK293 human embryonic kidney cells (ATCC #CRL-1573) were propagated in EMEM tissue culture medium as described by ATCC in an atmosphere of 5% C02 an...
Ligand InfoPC cidPC sid
In DepthDetails US Patent
TargetSolute carrier family 22 member 12(Homo sapiens (Human))
Ardea Biosciences
US Patent
LigandPNGBDBM377553(US10266493, Example 2PP | US10919858, Example 2PP)
Affinity DataEC50:  26nM. Assay description: HEK293 human embryonic kidney cells (ATCC# CRL-1573) were propagated in EMEM tissue culture medium as described by ATCC in an atmosphere of 5% CO2 an...
Ligand InfoPC cidPC sid
In DepthDetails US Patent