BDBM378013 N-(1-(1-(L-alanyl)piperidin-4-yl)ethyl)nicotinamide::US10266526, Compound 141
SMILES C[C@H](N)C(=O)N1CCC(CC1)C(C)NC(=O)c1cccnc1
InChI Key InChIKey=SFWFUNZMGDDGDG-PXYINDEMSA-N
Data  1 IC50
  Tab Delimited (TSV)   2D SDfile   Computed 3D by Vconf -m prep SDfile
Find this compound or compounds like it in BindingDB:
Activity Spreadsheet -- Enzyme Inhibition Constant Data from BindingDB
Found 1 hit for monomerid = 378013
TargetHistone-lysine N-methyltransferase SMYD3(Homo sapiens (Human))
Epizyme
US Patent
LigandPNGBDBM378013(N-(1-(1-(L-alanyl)piperidin-4-yl)ethyl)nicotinamid...)
Affinity DataIC50: >1.00E+5nM. Assay description: The assays were all performed in a buffer consisting of 25 mM Tris-Cl pH 8.0, 1 mM TCEP, 0.005% BSG, and 0.005% Tween 20, prepared on the day of use....
Ligand InfoPC cidPC sid
In DepthDetails US Patent