BDBM378100 N-(1-(1-(L-alanyl)piperidin-4-yl)ethyl)benzo[d]thiazole-6-carboxamide::US10266526, Compound 228
SMILES C[C@H](N)C(=O)N1CCC(CC1)C(C)NC(=O)c1ccc2ncsc2c1
InChI Key InChIKey=NPUBEPKTGQWRNT-PXYINDEMSA-N
Data  1 IC50
  Tab Delimited (TSV)   2D SDfile   Computed 3D by Vconf -m prep SDfile
Find this compound or compounds like it in BindingDB:
Activity Spreadsheet -- Enzyme Inhibition Constant Data from BindingDB
Found 1 hit for monomerid = 378100
TargetHistone-lysine N-methyltransferase SMYD3(Homo sapiens (Human))
Epizyme
US Patent
LigandPNGBDBM378100(N-(1-(1-(L-alanyl)piperidin-4-yl)ethyl)benzo[d]thi...)
Affinity DataIC50: >1.00E+5nM. Assay description: The assays were all performed in a buffer consisting of 25 mM Tris-Cl pH 8.0, 1 mM TCEP, 0.005% BSG, and 0.005% Tween 20, prepared on the day of use....
Ligand InfoPC cidPC sid
In DepthDetails US Patent