BDBM37826 (4Z)-4-[(4-ethoxyphenyl)-hydroxymethylidene]-5-(2-furanyl)-1-(2-oxolanylmethyl)pyrrolidine-2,3-dione::(4Z)-4-[(4-ethoxyphenyl)-hydroxymethylidene]-5-(furan-2-yl)-1-(oxolan-2-ylmethyl)pyrrolidine-2,3-dione::(4Z)-4-[(4-ethoxyphenyl)-oxidanyl-methylidene]-5-(furan-2-yl)-1-(oxolan-2-ylmethyl)pyrrolidine-2,3-dione::(4Z)-5-(2-furyl)-4-[hydroxy(p-phenetyl)methylene]-1-(tetrahydrofurfuryl)pyrrolidine-2,3-quinone::4-(4-ethoxybenzoyl)-5-(2-furyl)-3-hydroxy-1-(tetrahydro-2-furanylmethyl)-1,5-dihydro-2H-pyrrol-2-one::MLS000547966::SMR000114034::cid_9549675
SMILES CCOc1ccc(cc1)C(=O)C1C(N(CC2CCCO2)C(=O)C1=O)c1ccco1
InChI Key InChIKey=SYACAHCUKULFTE-UHFFFAOYSA-N
Data  2 KI  2 IC50
  Tab Delimited (TSV)   2D SDfile   Computed 3D by Vconf -m prep SDfile
Find this compound or compounds like it in BindingDB:
Activity Spreadsheet -- Enzyme Inhibition Constant Data from BindingDB
Found 4 hits for monomerid = 37826
TargetfMet-Leu-Phe receptor(Homo sapiens (Human))
Nmmlsc
Curated by PubChem BioAssay
LigandPNGBDBM37826((4Z)-4-[(4-ethoxyphenyl)-hydroxymethylidene]-5-(2-...)
Affinity DataKi:  2.10E+4nM. Assay description: University of New Mexico Assay Overview: Assay Support: NIH 1R03MH076381-01 Assay for Formylpeptide Receptor Family Ligands PI: Bruce S. Edwards, Ph...
In DepthDetails PCBioAssay
TargetN-formyl peptide receptor 2(Homo sapiens (Human))
Nmmlsc
Curated by PubChem BioAssay
LigandPNGBDBM37826((4Z)-4-[(4-ethoxyphenyl)-hydroxymethylidene]-5-(2-...)
Affinity DataKi: >4.03E+4nM. Assay description: University of New Mexico Assay Overview Assay Support: NIH 1R03MH076381-01 Assay for Formylpeptide Receptor Family Ligands PI: Bruce S. Edwards, Ph....
In DepthDetails PCBioAssay
TargetN-formyl peptide receptor 2(Homo sapiens (Human))
Nmmlsc
Curated by PubChem BioAssay
LigandPNGBDBM37826((4Z)-4-[(4-ethoxyphenyl)-hydroxymethylidene]-5-(2-...)
Affinity DataIC50: >6.67E+4nM. Assay description: University of New Mexico Assay Overview Assay Support: NIH 1R03MH076381-01 Assay for Formylpeptide Receptor Family Ligands PI: Bruce S. Edwards, Ph....
In DepthDetails PCBioAssay
TargetfMet-Leu-Phe receptor(Homo sapiens (Human))
Nmmlsc
Curated by PubChem BioAssay
LigandPNGBDBM37826((4Z)-4-[(4-ethoxyphenyl)-hydroxymethylidene]-5-(2-...)
Affinity DataIC50:  3.20E+4nM. Assay description: University of New Mexico Assay Overview: Assay Support: NIH 1R03MH076381-01 Assay for Formylpeptide Receptor Family Ligands PI: Bruce S. Edwards, Ph...
In DepthDetails PCBioAssay