BDBM378763 1-cyclopropyl-N-(1-((1-ethyl-1H-pyrazol-4-yl)methyl)azetidin-3-yl)-1H-1,2,3-triazole-4-carboxamide::US10266526, Compound 946
SMILES CCn1cc(CN2CC(C2)NC(=O)c2cn(nn2)C2CC2)cn1
InChI Key InChIKey=LZVUBVRFYZCYJO-UHFFFAOYSA-N
Data  1 IC50
  Tab Delimited (TSV)   2D SDfile   Computed 3D by Vconf -m prep SDfile
Find this compound or compounds like it in BindingDB:
Activity Spreadsheet -- Enzyme Inhibition Constant Data from BindingDB
Found 1 hit for monomerid = 378763
TargetN-lysine methyltransferase SMYD2(Homo sapiens (Human))
Epizyme
US Patent
LigandPNGBDBM378763(1-cyclopropyl-N-(1-((1-ethyl-1H-pyrazol-4-yl)methy...)
Affinity DataIC50:  2.00E+3nM. Assay description: The assays were all performed in a buffer consisting of 20 mM Bicine (pH=7.6), 1 mM TCEP, 0.005% Bovine Skin Gelatin, and 0.002% Tween20, prepared on...
Ligand InfoPC cidPC sid
In DepthDetails US Patent