BDBM378843 US10266528, Compound 18
SMILES CC1(CC1)c1noc(n1)C(=O)NCc1ccc(cc1C(F)(F)F)-c1ccnc2[nH]c(=O)[nH]c12
InChI Key InChIKey=DFBGVNWBRWHEHZ-UHFFFAOYSA-N
Data  1 IC50
  Tab Delimited (TSV)   2D SDfile   Computed 3D by Vconf -m prep SDfile
Find this compound or compounds like it in BindingDB:
Activity Spreadsheet -- Enzyme Inhibition Constant Data from BindingDB
Found 1 hit for monomerid = 378843
TargetTyrosine-protein kinase BTK(Homo sapiens (Human))
Merck Patent
US Patent
LigandPNGBDBM378843(US10266528, Compound 18)
Affinity DataIC50: <10nM. Assay description: Briefly, 2.5× stocks of full-length human BTK (08-080) from CarnaBio USA, Inc., Natick, Mass., 1.6×ATP and appropriate kinKDR peptide substrate (FITC...
Ligand InfoPC cidPC sid
In DepthDetails US Patent