BDBM379086 Preparation of 4-({2-[1-(2-fluorobenzyl)-1H-indazol-3-yl]-5-hydroxypyrimidin-4-yl}amino)pyridine-3-carbonitrile::US10266548, Example 26-1
SMILES Oc1cnc(nc1Nc1ccncc1C#N)-c1nn(Cc2ccccc2F)c2ccccc12
InChI Key InChIKey=NBDVQFWOWMQCLS-UHFFFAOYSA-N
Data  1 IC50
  Tab Delimited (TSV)   2D SDfile   Computed 3D by Vconf -m prep SDfile
Find this compound or compounds like it in BindingDB:
Activity Spreadsheet -- Enzyme Inhibition Constant Data from BindingDB
Found 1 hit for monomerid = 379086
TargetMitotic checkpoint serine/threonine-protein kinase BUB1(Homo sapiens (Human))
Bayer Intellectual Property
US Patent
LigandPNGBDBM379086(Preparation of 4-({2-[1-(2-fluorobenzyl)-1H-indazo...)
Affinity DataIC50:  17nM. Assay description: Bub1-inhibitory activities of compounds described in the present invention were quantified using a time-resolved fluorescence energy transfer (TR-FRE...
Ligand InfoPC cidPC sid
In DepthDetails US Patent