BDBM379172 2-(5-Bromo-2-(2-methoxy-4-morpholinophenylamino) pyrimidin-4-ylamino)-N—N-dimethylbenzenesulfonamide::US10266549, Example 80::US10774092, Example 80
SMILES COc1cc(ccc1Nc1ncc(Br)c(Nc2ccccc2S(=O)(=O)N(C)C)n1)N1CCOCC1
InChI Key InChIKey=ZWMDEVPYVGQJHU-UHFFFAOYSA-N
Data  2 IC50
  Tab Delimited (TSV)   2D SDfile   Computed 3D by Vconf -m prep SDfile
Find this compound or compounds like it in BindingDB:
Activity Spreadsheet -- Enzyme Inhibition Constant Data from BindingDB
Found 2 hits for monomerid = 379172
TargetSerine/threonine-protein kinase ULK1(Homo sapiens (Human))
Salk Institute For Biological Studies
US Patent
LigandPNGBDBM379172(2-(5-Bromo-2-(2-methoxy-4-morpholinophenylamino) p...)
Affinity DataIC50: <200nM. Assay description: ULK1 inhibition assay is a screening assay to identify compounds that inhibit kinase activity of ULK1 using the ULKtide peptide. In some embodiments,...
Ligand InfoPC cidPC sid
In DepthDetails US Patent
TargetSerine/threonine-protein kinase ULK1(Homo sapiens (Human))
Salk Institute For Biological Studies
US Patent
LigandPNGBDBM379172(2-(5-Bromo-2-(2-methoxy-4-morpholinophenylamino) p...)
Affinity DataIC50: <200nM. Assay description: Gamma-32P assays to measure ULK1 kinase activity were performed as previously described. Briefly, Flag ULK1 was transfected into HEK293T cells and 20...
Ligand InfoPC cidPC sid
In DepthDetails US Patent