BDBM379214 US10266549, Example 123a::US10774092, Example 123a
SMILES COc1cc(ccc1Nc1nc(Nc2ccc3NC(=O)CCc3c2)ncc1C(F)(F)F)N1CCOCC1
InChI Key InChIKey=IPERBROSEYCIRM-UHFFFAOYSA-N
Data  2 IC50
  Tab Delimited (TSV)   2D SDfile   Computed 3D by Vconf -m prep SDfile
Find this compound or compounds like it in BindingDB:
Activity Spreadsheet -- Enzyme Inhibition Constant Data from BindingDB
Found 2 hits for monomerid = 379214
TargetSerine/threonine-protein kinase ULK1(Homo sapiens (Human))
Salk Institute For Biological Studies
US Patent
LigandPNGBDBM379214(US10266549, Example 123a | US10774092, Example 123...)
Affinity DataIC50: <200nM. Assay description: ULK1 inhibition assay is a screening assay to identify compounds that inhibit kinase activity of ULK1 using the ULKtide peptide. In some embodiments,...
Ligand InfoPC cidPC sid
In DepthDetails US Patent
TargetSerine/threonine-protein kinase ULK1(Homo sapiens (Human))
Salk Institute For Biological Studies
US Patent
LigandPNGBDBM379214(US10266549, Example 123a | US10774092, Example 123...)
Affinity DataIC50: <200nM. Assay description: Gamma-32P assays to measure ULK1 kinase activity were performed as previously described. Briefly, Flag ULK1 was transfected into HEK293T cells and 20...
Ligand InfoPC cidPC sid
In DepthDetails US Patent