BDBM381756 US10272079, Compound 113
SMILES CN1C[C@@H](c2cccc(c2)S(=O)(=O)NCCOCCOCCNC(=O)CCC(CCC(=O)NCCOCCOCCNS(=O)(=O)c2cccc(c2)[C@@H]2CN(C)Cc3c(Cl)cc(Cl)cc23)(CCC(=O)NCCOCCOCCNS(=O)(=O)c2cccc(c2)[C@@H]2CN(C)Cc3c(Cl)cc(Cl)cc23)NCc2ccc(cc2)-c2ccc(Cl)cc2)c2cc(Cl)cc(Cl)c2C1
InChI Key InChIKey=CJEJZBSOQQZOCO-MNVOLFNWSA-N
Data  2 IC50
  Tab Delimited (TSV)   2D SDfile   Computed 3D by Vconf -m prep SDfile
Find this compound or compounds like it in BindingDB:
Activity Spreadsheet -- Enzyme Inhibition Constant Data from BindingDB
Found 2 hits for monomerid = 381756
TargetSodium/hydrogen exchanger 3(Homo sapiens (Human))
Ardelyx
US Patent
LigandPNGBDBM381756(US10272079, Compound 113)
Affinity DataIC50: <1.00E+4nM. Assay description: Cell-based activity under Prompt Conditions. Rat or human NHE3-mediated Na+-dependent H+ antiport was measured using a modification of the pH sensiti...
Ligand InfoPC cidPC sid
In DepthDetails US Patent
TargetSodium/hydrogen exchanger 3(Rattus norvegicus)
Ardelyx
US Patent
LigandPNGBDBM381756(US10272079, Compound 113)
Affinity DataIC50: <1.00E+4nM. Assay description: Cell-based activity under Prompt Conditions. Rat or human NHE3-mediated Na+-dependent H+ antiport was measured using a modification of the pH sensiti...
Ligand InfoPC cidPC sid
In DepthDetails US Patent