BDBM38209 US8546380, 52::US8633188, 52
SMILES C[C@@H](NC(=O)c1ccc(s1)C1(C)CCSC(N)=N1)c1ccccc1
InChI Key InChIKey=ZBRHNTDGQMSNFS-GKOGFXNCSA-N
Data  2 IC50
  Tab Delimited (TSV)   2D SDfile   Computed 3D by Vconf -m prep SDfile
Find this compound or compounds like it in BindingDB:
Activity Spreadsheet -- Enzyme Inhibition Constant Data from BindingDB
Found 2 hits for monomerid = 38209
TargetBeta-secretase 1(Homo sapiens (Human))
Shionogi
US Patent
LigandPNGBDBM38209(US8546380, 52 | US8633188, 52)
Affinity DataIC50:  1.00E+4nMpH: 5.0 T: 2°C. Assay description: Zero point five μL of the test compounds (dissolved in N,N′-dimethylsulfoxide) were incubated with 48.5 μL of the fluorescence-quench...
Ligand InfoPC cidPC sid
In DepthDetails US Patent
TargetBeta-secretase 1(Homo sapiens (Human))
Shionogi
US Patent
LigandPNGBDBM38209(US8546380, 52 | US8633188, 52)
Affinity DataIC50:  1.00E+4nM. Assay description: Inhibition assay using beta-Secretase activity.
Ligand InfoPC cidPC sid
In DepthDetails US Patent