BDBM38216 US8546380, 739::US8633188, 739
SMILES CC1(CCSC(N)=N1)c1cc(Cl)cc(NC(=O)c2ccc(Cl)cn2)c1
InChI Key InChIKey=ISFYHTGWOJKTMA-UHFFFAOYSA-N
Data  2 IC50
  Tab Delimited (TSV)   2D SDfile   Computed 3D by Vconf -m prep SDfile
Find this compound or compounds like it in BindingDB:
Activity Spreadsheet -- Enzyme Inhibition Constant Data from BindingDB
Found 2 hits for monomerid = 38216
TargetBeta-secretase 1(Homo sapiens (Human))
Shionogi
US Patent
LigandPNGBDBM38216(US8546380, 739 | US8633188, 739)
Affinity DataIC50:  49nMpH: 5.0 T: 2°C. Assay description: Zero point five μL of the test compounds (dissolved in N,N′-dimethylsulfoxide) were incubated with 48.5 μL of the fluorescence-quench...
In DepthDetails US Patent
TargetBeta-secretase 1(Homo sapiens (Human))
Shionogi
US Patent
LigandPNGBDBM38216(US8546380, 739 | US8633188, 739)
Affinity DataIC50:  49nM. Assay description: Inhibition assay using beta-Secretase activity.
In DepthDetails US Patent