BDBM38274 4-(1,3-benzodioxol-5-yl)-5-keto-N-(2-methoxyphenyl)-2-methyl-4,6,7,8-tetrahydro-1H-quinoline-3-carboxamide::4-(1,3-benzodioxol-5-yl)-N-(2-methoxyphenyl)-2-methyl-5-oxidanylidene-4,6,7,8-tetrahydro-1H-quinoline-3-carboxamide::4-(1,3-benzodioxol-5-yl)-N-(2-methoxyphenyl)-2-methyl-5-oxo-4,6,7,8-tetrahydro-1H-quinoline-3-carboxamide::4-Benzo[1,3]dioxol-5-yl-2-methyl-5-oxo-1,4,5,6,7,8-hexahydro-quinoline-3-carboxylic acid (2-methoxy-phenyl)-amide::MLS000072671::SMR000011415::cid_649616
SMILES COc1ccccc1NC(=O)C1=C(C)N=C2CCCC(=O)C2C1c1ccc2OCOc2c1
InChI Key InChIKey=MTYQWOSRQIXXCE-UHFFFAOYSA-N
Data  1 IC50
  Tab Delimited (TSV)   2D SDfile   Computed 3D by Vconf -m prep SDfile
Find this compound or compounds like it in BindingDB:
Activity Spreadsheet -- Enzyme Inhibition Constant Data from BindingDB
Found 1 hit for monomerid = 38274
TargetDiphosphomevalonate decarboxylase(Streptococcus pneumoniae D39)
Srmlsc
Curated by PubChem BioAssay
LigandPNGBDBM38274(4-(1,3-benzodioxol-5-yl)-5-keto-N-(2-methoxyphenyl...)
Affinity DataIC50:  7.63E+4nM. Assay description: Southern Research Molecular Libraries Screening Center (SRMLSC) Southern Research Institute (Birmingham, Alabama) NIH Molecular Libraries Screening C...
Ligand InfoPC cidPC sid
In DepthDetails PCBioAssay