BDBM38292 2-(1-Benzyl-1H-tetrazol-5-ylsulfanyl)-N-phenethyl-acetamide::2-(1-benzyltetrazol-5-yl)sulfanyl-N-(2-phenylethyl)acetamide::2-[(1-benzyltetrazol-5-yl)thio]-N-phenethyl-acetamide::MLS000068155::N-(2-phenylethyl)-2-[[1-(phenylmethyl)-1,2,3,4-tetrazol-5-yl]sulfanyl]ethanamide::N-(2-phenylethyl)-2-[[1-(phenylmethyl)-5-tetrazolyl]thio]acetamide::SMR000000902::cid_652875
SMILES O=C(CSc1nnnn1Cc1ccccc1)NCCc1ccccc1
InChI Key InChIKey=SNZBTIJDZIZYTJ-UHFFFAOYSA-N
Data  1 IC50
  Tab Delimited (TSV)   2D SDfile   Computed 3D by Vconf -m prep SDfile
Find this compound or compounds like it in BindingDB:
Activity Spreadsheet -- Enzyme Inhibition Constant Data from BindingDB
Found 1 hit for monomerid = 38292
TargetDiphosphomevalonate decarboxylase(Streptococcus pneumoniae D39)
Srmlsc
Curated by PubChem BioAssay
LigandPNGBDBM38292(2-(1-Benzyl-1H-tetrazol-5-ylsulfanyl)-N-phenethyl-...)
Affinity DataIC50: >1.00E+7nM. Assay description: Southern Research Molecular Libraries Screening Center (SRMLSC) Southern Research Institute (Birmingham, Alabama) NIH Molecular Libraries Screening C...
In DepthDetails PCBioAssay