BDBM38635 1-(5-bicyclo[2.2.1]hept-2-enylmethyl)-4-phenyl-piperazine::1-(5-bicyclo[2.2.1]hept-2-enylmethyl)-4-phenylpiperazine::1-(bicyclo[2.2.1]hept-5-en-2-ylmethyl)-4-phenylpiperazine::MLS000061100::SMR000069612::cid_2845487
SMILES [H]C12CC(CN3CCN(CC3)c3ccccc3)C([H])(C1)C=C2
InChI Key InChIKey=XHLIVZUGWXPOEE-UHFFFAOYSA-N
Data  3 IC50
  Tab Delimited (TSV)   2D SDfile   Computed 3D by Vconf -m prep SDfile
Find this compound or compounds like it in BindingDB:
Activity Spreadsheet -- Enzyme Inhibition Constant Data from BindingDB
Found 3 hits for monomerid = 38635
TargetMevalonate kinase(Streptococcus pneumoniae D39)
Srmlsc
Curated by PubChem BioAssay
LigandPNGBDBM38635(1-(5-bicyclo[2.2.1]hept-2-enylmethyl)-4-phenyl-pip...)
Affinity DataIC50: >1.00E+7nM. Assay description: Southern Research Molecular Libraries Screening Center (SRMLSC) Southern Research Institute (Birmingham, Alabama) NIH Molecular Libraries Screening C...
In DepthDetails PCBioAssay
TargetMevalonate kinase(Streptococcus pneumoniae D39)
Srmlsc
Curated by PubChem BioAssay
LigandPNGBDBM38635(1-(5-bicyclo[2.2.1]hept-2-enylmethyl)-4-phenyl-pip...)
Affinity DataIC50:  1.37E+5nM. Assay description: Southern Research Molecular Libraries Screening Center (SRMLSC) Southern Research Institute (Birmingham, Alabama) NIH Molecular Libraries Screening C...
In DepthDetails PCBioAssay
TargetMevalonate kinase(Streptococcus pneumoniae D39)
Srmlsc
Curated by PubChem BioAssay
LigandPNGBDBM38635(1-(5-bicyclo[2.2.1]hept-2-enylmethyl)-4-phenyl-pip...)
Affinity DataIC50: >1.00E+7nM. Assay description: Southern Research Molecular Libraries Screening Center (SRMLSC) Southern Research Institute (Birmingham, Alabama) NIH Molecular Libraries Screening C...
In DepthDetails PCBioAssay