BDBM386545 (1R,3S,5R)-2-(2- (3-acetyl-5-(2- methylpyrimidin- 5-yl)-1H-indazol- 1-yl)acetyl)-N-(6- bromo-3- methylpyridin-2- yl)-5-methyl-2- azabicyclo[3.1.0] hexane-3- carboxamide::US10287301, Compound 485::US10822352, Comp No. 485::US11084800, Cpd No. 279
SMILES CC(=O)c1nn(CC(=O)N2[C@@H]3C[C@]3(C)C[C@H]2C(=O)Nc2nc(Br)ccc2C)c2ccc(cc12)-c1cnc(C)nc1
InChI Key InChIKey=OCXAGXCMZACNEC-CTWZREHQSA-N
Data  3 IC50
  Tab Delimited (TSV)   2D SDfile   Computed 3D by Vconf -m prep SDfile
Find this compound or compounds like it in BindingDB:
Activity Spreadsheet -- Enzyme Inhibition Constant Data from BindingDB
Found 3 hits for monomerid = 386545
TargetComplement factor D(Homo sapiens (Human))
Achillion Pharmaceuticals
US Patent
LigandPNGBDBM386545((1R,3S,5R)-2-(2- (3-acetyl-5-(2- methylpyrimidin- ...)
Affinity DataIC50: <1.00E+3nM. Assay description: Human Factor D (purified from human serum, Complement Technology, Inc.) at 80 nM final concentration was incubated with test compound at various conc...
In DepthDetails US Patent
TargetComplement factor D(Homo sapiens (Human))
Achillion Pharmaceuticals
US Patent
LigandPNGBDBM386545((1R,3S,5R)-2-(2- (3-acetyl-5-(2- methylpyrimidin- ...)
Affinity DataIC50: >1.00E+4nM. Assay description: Human Factor D (purified from human serum, Complement Technology, Inc.) at 80 nM final concentration is incubated with test compound at various conce...
In DepthDetails US Patent
TargetComplement factor D(Homo sapiens (Human))
Achillion Pharmaceuticals
US Patent
LigandPNGBDBM386545((1R,3S,5R)-2-(2- (3-acetyl-5-(2- methylpyrimidin- ...)
Affinity DataIC50: <1.00E+3nM. Assay description: Human Factor D (purified from human serum, Complement Technology, Inc.) at 80 nM final concentration was incubated with test compound at various conc...
In DepthDetails US Patent