BDBM38659 2-[benzyl(cyclohexylmethyl)amino]ethanol::2-[cyclohexylmethyl-(phenylmethyl)amino]ethanol::MLS000059204::SMR000069668::cid_783424
SMILES OCCN(CC1CCCCC1)Cc1ccccc1
InChI Key InChIKey=RZWUHDHJWWDPDK-UHFFFAOYSA-N
Data  3 IC50
  Tab Delimited (TSV)   2D SDfile   Computed 3D by Vconf -m prep SDfile
Find this compound or compounds like it in BindingDB:
Activity Spreadsheet -- Enzyme Inhibition Constant Data from BindingDB
Found 3 hits for monomerid = 38659
TargetMevalonate kinase(Streptococcus pneumoniae D39)
Srmlsc
Curated by PubChem BioAssay
LigandPNGBDBM38659(2-[benzyl(cyclohexylmethyl)amino]ethanol | 2-[cycl...)
Affinity DataIC50:  1.90E+5nM. Assay description: Southern Research Molecular Libraries Screening Center (SRMLSC) Southern Research Institute (Birmingham, Alabama) NIH Molecular Libraries Screening C...
In DepthDetails PCBioAssay
TargetMevalonate kinase(Streptococcus pneumoniae D39)
Srmlsc
Curated by PubChem BioAssay
LigandPNGBDBM38659(2-[benzyl(cyclohexylmethyl)amino]ethanol | 2-[cycl...)
Affinity DataIC50:  3.29E+5nM. Assay description: Southern Research Molecular Libraries Screening Center (SRMLSC) Southern Research Institute (Birmingham, Alabama) NIH Molecular Libraries Screening C...
In DepthDetails PCBioAssay
TargetMevalonate kinase(Streptococcus pneumoniae D39)
Srmlsc
Curated by PubChem BioAssay
LigandPNGBDBM38659(2-[benzyl(cyclohexylmethyl)amino]ethanol | 2-[cycl...)
Affinity DataIC50: >1.00E+7nM. Assay description: Southern Research Molecular Libraries Screening Center (SRMLSC) Southern Research Institute (Birmingham, Alabama) NIH Molecular Libraries Screening C...
In DepthDetails PCBioAssay