BDBM38732 2-furanyl-[4-[(4-methoxy-3-phenylmethoxyphenyl)methyl]-1-piperazinyl]methanone::MLS000108279::SMR000104240::[4-(3-benzoxy-4-methoxy-benzyl)piperazino]-(2-furyl)methanone::cid_1148134::furan-2-yl-[4-[(4-methoxy-3-phenylmethoxy-phenyl)methyl]piperazin-1-yl]methanone::furan-2-yl-[4-[(4-methoxy-3-phenylmethoxyphenyl)methyl]piperazin-1-yl]methanone
SMILES COc1ccc(CN2CCN(CC2)C(=O)c2ccco2)cc1OCc1ccccc1
InChI Key InChIKey=RHJSBZCOJFKXNB-UHFFFAOYSA-N
Data  3 IC50  2 EC50
  Tab Delimited (TSV)   2D SDfile   Computed 3D by Vconf -m prep SDfile
Find this compound or compounds like it in BindingDB:
Activity Spreadsheet -- Enzyme Inhibition Constant Data from BindingDB
Found 5 hits for monomerid = 38732
TargetMevalonate kinase(Streptococcus pneumoniae D39)
Srmlsc
Curated by PubChem BioAssay
LigandPNGBDBM38732(2-furanyl-[4-[(4-methoxy-3-phenylmethoxyphenyl)met...)
Affinity DataIC50:  1.89E+5nM. Assay description: Southern Research Molecular Libraries Screening Center (SRMLSC) Southern Research Institute (Birmingham, Alabama) NIH Molecular Libraries Screening C...
In DepthDetails PCBioAssay
TargetMevalonate kinase(Streptococcus pneumoniae D39)
Srmlsc
Curated by PubChem BioAssay
LigandPNGBDBM38732(2-furanyl-[4-[(4-methoxy-3-phenylmethoxyphenyl)met...)
Affinity DataIC50: >1.00E+7nM. Assay description: Southern Research Molecular Libraries Screening Center (SRMLSC) Southern Research Institute (Birmingham, Alabama) NIH Molecular Libraries Screening C...
In DepthDetails PCBioAssay
Target5-hydroxytryptamine receptor 2A(Mus musculus (Mouse))
The Scripps Research Institute Molecular Screening Center
Curated by PubChem BioAssay
LigandPNGBDBM38732(2-furanyl-[4-[(4-methoxy-3-phenylmethoxyphenyl)met...)
Affinity DataEC50:  7.61E+4nM. Assay description: Source (MLPCN Center Name): The Scripps Research Institute Molecular Screening Center (SRIMSC) Affiliation: The Scripps Research Institute, TSRI Assa...
In DepthDetails PCBioAssay
TargetMu-type opioid receptor(Homo sapiens (Human))
The Scripps Research Institute Molecular Screening Center
Curated by PubChem BioAssay
LigandPNGBDBM38732(2-furanyl-[4-[(4-methoxy-3-phenylmethoxyphenyl)met...)
Affinity DataEC50:  9.25E+4nM. Assay description: Source (MLPCN Center Name): The Scripps Research Institute Molecular Screening Center (SRIMSC) Assay Provider: Laura Bohn External Assay ID: OPRM1_AC...
In DepthDetails PCBioAssay
TargetMevalonate kinase(Streptococcus pneumoniae D39)
Srmlsc
Curated by PubChem BioAssay
LigandPNGBDBM38732(2-furanyl-[4-[(4-methoxy-3-phenylmethoxyphenyl)met...)
Affinity DataIC50: >1.00E+7nM. Assay description: Southern Research Molecular Libraries Screening Center (SRMLSC) Southern Research Institute (Birmingham, Alabama) NIH Molecular Libraries Screening C...
In DepthDetails PCBioAssay