BDBM38779 1-[4-(dimethylamino)benzyl]-N,N-diethyl-nipecotamide::1-[[4-(dimethylamino)phenyl]methyl]-N,N-diethyl-3-piperidinecarboxamide::1-[[4-(dimethylamino)phenyl]methyl]-N,N-diethyl-piperidine-3-carboxamide::1-[[4-(dimethylamino)phenyl]methyl]-N,N-diethylpiperidine-3-carboxamide::MLS000105209::SMR000102090::cid_2837886
SMILES CCN(CC)C(=O)C1CCCN(Cc2ccc(cc2)N(C)C)C1
InChI Key InChIKey=KJOMMTWHMFNFFY-UHFFFAOYSA-N
Data  3 IC50
  Tab Delimited (TSV)   2D SDfile   Computed 3D by Vconf -m prep SDfile
Find this compound or compounds like it in BindingDB:
Activity Spreadsheet -- Enzyme Inhibition Constant Data from BindingDB
Found 3 hits for monomerid = 38779
TargetMevalonate kinase(Streptococcus pneumoniae D39)
Srmlsc
Curated by PubChem BioAssay
LigandPNGBDBM38779(1-[4-(dimethylamino)benzyl]-N,N-diethyl-nipecotami...)
Affinity DataIC50: >1.00E+7nM. Assay description: Southern Research Molecular Libraries Screening Center (SRMLSC) Southern Research Institute (Birmingham, Alabama) NIH Molecular Libraries Screening C...
In DepthDetails PCBioAssay
TargetMevalonate kinase(Streptococcus pneumoniae D39)
Srmlsc
Curated by PubChem BioAssay
LigandPNGBDBM38779(1-[4-(dimethylamino)benzyl]-N,N-diethyl-nipecotami...)
Affinity DataIC50: >1.00E+7nM. Assay description: Southern Research Molecular Libraries Screening Center (SRMLSC) Southern Research Institute (Birmingham, Alabama) NIH Molecular Libraries Screening C...
In DepthDetails PCBioAssay
TargetMevalonate kinase(Streptococcus pneumoniae D39)
Srmlsc
Curated by PubChem BioAssay
LigandPNGBDBM38779(1-[4-(dimethylamino)benzyl]-N,N-diethyl-nipecotami...)
Affinity DataIC50:  1.93E+5nM. Assay description: Southern Research Molecular Libraries Screening Center (SRMLSC) Southern Research Institute (Birmingham, Alabama) NIH Molecular Libraries Screening C...
In DepthDetails PCBioAssay