BDBM38791 2-furanyl-[4-[[2-(trifluoromethyl)phenyl]methyl]-1-piperazinyl]methanone::2-furyl-[4-[2-(trifluoromethyl)benzyl]piperazino]methanone::MLS000109245::SMR000105190::cid_780136::furan-2-yl-[4-[[2-(trifluoromethyl)phenyl]methyl]piperazin-1-yl]methanone
SMILES FC(F)(F)c1ccccc1CN1CCN(CC1)C(=O)c1ccco1
InChI Key InChIKey=STFIBGVKJMEGNZ-UHFFFAOYSA-N
Data  3 IC50
  Tab Delimited (TSV)   2D SDfile   Computed 3D by Vconf -m prep SDfile
Find this compound or compounds like it in BindingDB:
Activity Spreadsheet -- Enzyme Inhibition Constant Data from BindingDB
Found 3 hits for monomerid = 38791
TargetMevalonate kinase(Streptococcus pneumoniae D39)
Srmlsc
Curated by PubChem BioAssay
LigandPNGBDBM38791(2-furanyl-[4-[[2-(trifluoromethyl)phenyl]methyl]-1...)
Affinity DataIC50: >1.00E+7nM. Assay description: Southern Research Molecular Libraries Screening Center (SRMLSC) Southern Research Institute (Birmingham, Alabama) NIH Molecular Libraries Screening C...
In DepthDetails PCBioAssay
TargetMevalonate kinase(Streptococcus pneumoniae D39)
Srmlsc
Curated by PubChem BioAssay
LigandPNGBDBM38791(2-furanyl-[4-[[2-(trifluoromethyl)phenyl]methyl]-1...)
Affinity DataIC50: >1.00E+7nM. Assay description: Southern Research Molecular Libraries Screening Center (SRMLSC) Southern Research Institute (Birmingham, Alabama) NIH Molecular Libraries Screening C...
In DepthDetails PCBioAssay
TargetMevalonate kinase(Streptococcus pneumoniae D39)
Srmlsc
Curated by PubChem BioAssay
LigandPNGBDBM38791(2-furanyl-[4-[[2-(trifluoromethyl)phenyl]methyl]-1...)
Affinity DataIC50:  1.18E+5nM. Assay description: Southern Research Molecular Libraries Screening Center (SRMLSC) Southern Research Institute (Birmingham, Alabama) NIH Molecular Libraries Screening C...
In DepthDetails PCBioAssay