BDBM39033 MLS000062301::N-[2-(3,5-dimethyl-1-pyrazolyl)-8-quinolinyl]methanesulfonamide::N-[2-(3,5-dimethyl-1H-pyrazol-1-yl)-8-quinolinyl]methanesulfonamide::N-[2-(3,5-dimethylpyrazol-1-yl)-8-quinolyl]methanesulfonamide::N-[2-(3,5-dimethylpyrazol-1-yl)quinolin-8-yl]methanesulfonamide::SMR000071117::cid_885036
SMILES Cc1cc(C)n(n1)-c1ccc2cccc(NS(C)(=O)=O)c2n1
InChI Key InChIKey=YVJYHMAMNYGITG-UHFFFAOYSA-N
Data  4 IC50
  Tab Delimited (TSV)   2D SDfile   Computed 3D by Vconf -m prep SDfile
Find this compound or compounds like it in BindingDB:
Activity Spreadsheet -- Enzyme Inhibition Constant Data from BindingDB
Found 4 hits for monomerid = 39033
TargetSteroidogenic factor 1(Homo sapiens (Human))
The Scripps Research Institute Molecular Screening Center
Curated by PubChem BioAssay
LigandPNGBDBM39033(MLS000062301 | N-[2-(3,5-dimethyl-1-pyrazolyl)-8-q...)
Affinity DataIC50:  3.42E+3nM. Assay description: Source (MLSCN Center Name): The Scripps Research Institute Molecular Screening Center Center Affiliation: The Scripps Research Institute, TSRI Assay ...
In DepthDetails PCBioAssay
TargetIsoform 2 of Nuclear receptor ROR-alpha (Alpha-2)(Homo sapiens (Human))
The Scripps Research Institute Molecular Screening Center
Curated by PubChem BioAssay
LigandPNGBDBM39033(MLS000062301 | N-[2-(3,5-dimethyl-1-pyrazolyl)-8-q...)
Affinity DataIC50:  8.26E+3nM. Assay description: Source (MLSCN Center Name): The Scripps Research Institute Molecular Screening Center Center Affiliation: The Scripps Research Institute, TSRI Assay ...
In DepthDetails PCBioAssay
TargetSteroidogenic factor 1(Homo sapiens (Human))
The Scripps Research Institute Molecular Screening Center
Curated by PubChem BioAssay
LigandPNGBDBM39033(MLS000062301 | N-[2-(3,5-dimethyl-1-pyrazolyl)-8-q...)
Affinity DataIC50:  4.32E+3nM. Assay description: Source (MLSCN Center Name): The Scripps Research Institute Molecular Screening Center Center Affiliation: The Scripps Research Institute, TSRI Assay ...
In DepthDetails PCBioAssay
TargetIsoform 2 of Nuclear receptor ROR-alpha (Alpha-2)(Homo sapiens (Human))
The Scripps Research Institute Molecular Screening Center
Curated by PubChem BioAssay
LigandPNGBDBM39033(MLS000062301 | N-[2-(3,5-dimethyl-1-pyrazolyl)-8-q...)
Affinity DataIC50:  3.38E+3nM. Assay description: Source (MLSCN Center Name): The Scripps Research Institute Molecular Screening Center Center Affiliation: The Scripps Research Institute, TSRI Assay ...
In DepthDetails PCBioAssay