BDBM391016 US9957264, Example 5-87::{(1R,2R)-2-fluoro-1-[3- ({4-[(1-methylethyl) sulfonyl]phenyl} amino)-4-oxo-4,5-dihydro- 1H-pyrazolo[4,3-c]pyridin- 1-yl]cyclohexyl}acetonitrile (from I-19A)
SMILES CC(C)S(=O)(=O)c1ccc(Nc2nn(c3cc[nH]c(=O)c23)[C@@]2(CC#N)CCCC[C@H]2F)cc1
InChI Key
Data  2 IC50
  Tab Delimited (TSV)   2D SDfile   Computed 3D by Vconf -m prep SDfile
Find this compound or compounds like it in BindingDB:
Activity Spreadsheet -- Enzyme Inhibition Constant Data from BindingDB
Found 2 hits for monomerid = 391016
TargetTyrosine-protein kinase JAK2(Homo sapiens (Human))
Merck Sharp & Dohme
US Patent
LigandPNGBDBM391016(US9957264, Example 5-87 | {(1R,2R)-2-fluoro-1-[3- ...)
Affinity DataIC50:  0.0500nM. Assay description: The ability of compounds to inhibit the activity of JAK1, JAK2, JAK3, and Tyk2 was measured using a recombinant purified GST-tagged catalytic domain ...
Ligand InfoPC cidPC sid
In DepthDetails US Patent
TargetTyrosine-protein kinase JAK1(Homo sapiens (Human))
Merck Sharp & Dohme
US Patent
LigandPNGBDBM391016(US9957264, Example 5-87 | {(1R,2R)-2-fluoro-1-[3- ...)
Affinity DataIC50:  0.0400nM. Assay description: The ability of compounds to inhibit the activity of JAK1, JAK2, JAK3, and Tyk2 was measured using a recombinant purified GST-tagged catalytic domain ...
Ligand InfoPC cidPC sid
In DepthDetails US Patent