BDBM391188 2-((3R,4R or 3S,4S)-4-(3-((2- (tert-butyl)-1-oxoisoindolin- 5-yl)amino)-4-oxo-4,5- dihydro-1H-pyrazolo[4,3- c]pyridin-1-yl)-3- fluorotetrahydro-2H-pyran- 4-yl)acetonitrile (derived from I-22A)::US9957264, Example 5-259
SMILES CC(C)(C)N1Cc2cc(Nc3nn(c4cc[nH]c(=O)c34)[C@]3(CC#N)CCOC[C@@H]3F)ccc2C1=O
InChI Key
Data  2 IC50
  Tab Delimited (TSV)   2D SDfile   Computed 3D by Vconf -m prep SDfile
Find this compound or compounds like it in BindingDB:
Activity Spreadsheet -- Enzyme Inhibition Constant Data from BindingDB
Found 2 hits for monomerid = 391188
TargetTyrosine-protein kinase JAK2(Homo sapiens (Human))
Merck Sharp & Dohme
US Patent
LigandPNGBDBM391188(2-((3R,4R or 3S,4S)-4-(3-((2- (tert-butyl)-1-oxois...)
Affinity DataIC50:  0.0500nM. Assay description: The ability of compounds to inhibit the activity of JAK1, JAK2, JAK3, and Tyk2 was measured using a recombinant purified GST-tagged catalytic domain ...
Ligand InfoPC cidPC sid
In DepthDetails US Patent
TargetTyrosine-protein kinase JAK1(Homo sapiens (Human))
Merck Sharp & Dohme
US Patent
LigandPNGBDBM391188(2-((3R,4R or 3S,4S)-4-(3-((2- (tert-butyl)-1-oxois...)
Affinity DataIC50:  0.0400nM. Assay description: The ability of compounds to inhibit the activity of JAK1, JAK2, JAK3, and Tyk2 was measured using a recombinant purified GST-tagged catalytic domain ...
Ligand InfoPC cidPC sid
In DepthDetails US Patent