BDBM393517 US9969687, Compound 176
SMILES Cc1c(ccc[n+]1[O-])N1C(=O)c2c(C1=O)c(NS(=O)(=O)c1ccc(cc1)C(C)(C)C)ccc2Cl
InChI Key InChIKey=SEZYEWZALINSCW-UHFFFAOYSA-N
Data  4 KI
  Tab Delimited (TSV)   2D SDfile   Computed 3D by Vconf -m prep SDfile
Find this compound or compounds like it in BindingDB:
Activity Spreadsheet -- Enzyme Inhibition Constant Data from BindingDB
Found 4 hits for monomerid = 393517
TargetC-C chemokine receptor type 9(Homo sapiens (Human))
Norgine
Curated by ChEMBL
LigandPNGBDBM393517(US9969687, Compound 176)
Affinity DataKi:  6nM. Assay description: Antagonist activity at CCR9 receptor in human MOLT4 cells assessed as inhibition of CCL25-induced increase in intracellular calcium level preincubate...
Ligand InfoPC cidPC sid
In DepthDetails ArticlePubMed
TargetC-C chemokine receptor type 9(Homo sapiens (Human))
Norgine
Curated by ChEMBL
LigandPNGBDBM393517(US9969687, Compound 176)
Affinity DataKi:  13nM. Assay description: Antagonist activity at CCR9A receptor (unknown origin) overexpressed in human MOLT4 cells assessed as inhibition of CCL25-induced increase in intrace...
Ligand InfoPC cidPC sid
In DepthDetails ArticlePubMed
TargetC-C chemokine receptor type 9(Homo sapiens (Human))
Norgine
Curated by ChEMBL
LigandPNGBDBM393517(US9969687, Compound 176)
Affinity DataKi:  13nM. Assay description: A calcium flux assay was used to determine the ability of the compounds to interfere with the binding between CCR9 and its chemokine ligand (TECK) in...
Ligand InfoPC cidPC sid
In DepthDetails US Patent
TargetC-C chemokine receptor type 9(Homo sapiens (Human))
Norgine
Curated by ChEMBL
LigandPNGBDBM393517(US9969687, Compound 176)
Affinity DataKi:  24nM. Assay description: Antagonist activity at CCR9 receptor in human MOLT4 cells assessed as inhibition of CCl25-mediated cell migration preincubated for 30 mins followed C...
Ligand InfoPC cidPC sid
In DepthDetails ArticlePubMed