BDBM39437 4-acetyl-2-(1-piperidinyl)-1-thieno[2,3-b]indolecarbonitrile::4-acetyl-2-piperidin-1-ylthieno[2,3-b]indole-1-carbonitrile::4-acetyl-2-piperidino-thien[2,3-b]indole-1-carbonitrile::4-ethanoyl-2-piperidin-1-yl-thieno[2,3-b]indole-1-carbonitrile::MLS000079075::SMR000039172::cid_658240
SMILES CC(=O)n1c2ccccc2c2c(C#N)c(sc12)N1CCCCC1
InChI Key InChIKey=JHLWYXYVDAVOSO-UHFFFAOYSA-N
Data  2 EC50
  Tab Delimited (TSV)   2D SDfile   Computed 3D by Vconf -m prep SDfile
Find this compound or compounds like it in BindingDB:
Activity Spreadsheet -- Enzyme Inhibition Constant Data from BindingDB
Found 2 hits for monomerid = 39437
TargetIsoform 2 of Nuclear receptor ROR-alpha (Alpha-2)(Homo sapiens (Human))
The Scripps Research Institute Molecular Screening Center
Curated by PubChem BioAssay
LigandPNGBDBM39437(4-acetyl-2-(1-piperidinyl)-1-thieno[2,3-b]indoleca...)
Affinity DataEC50:  3.98E+4nM. Assay description: Source (MLSCN Center Name): The Scripps Research Institute Molecular Screening Center Center Affiliation: The Scripps Research Institute, TSRI Assay ...
In DepthDetails PCBioAssay
TargetSteroidogenic factor 1(Homo sapiens (Human))
The Scripps Research Institute Molecular Screening Center
Curated by PubChem BioAssay
LigandPNGBDBM39437(4-acetyl-2-(1-piperidinyl)-1-thieno[2,3-b]indoleca...)
Affinity DataEC50: >3.30E+4nM. Assay description: Source (MLSCN Center Name): The Scripps Research Institute Molecular Screening Center Center Affiliation: The Scripps Research Institute, TSRI Assay ...
In DepthDetails PCBioAssay