BDBM394383 N-methyl-1-[1-(phenylsulfonyl)-5-(3-thienyl)-1H-pyrrol-3-yl]methanamine::US10308605, Example 30
SMILES CNCc1cc(-c2ccsc2)n(c1)S(=O)(=O)c1ccccc1
InChI Key InChIKey=QXPWKZFZVDWWRR-UHFFFAOYSA-N
Data  1 IC50
  Tab Delimited (TSV)   2D SDfile   Computed 3D by Vconf -m prep SDfile
Find this compound or compounds like it in BindingDB:
Activity Spreadsheet -- Enzyme Inhibition Constant Data from BindingDB
Found 1 hit for monomerid = 394383
TargetPotassium-transporting ATPase alpha chain 1(Sus scrofa (Pig))
Takeda Pharmaceutical
US Patent
LigandPNGBDBM394383(N-methyl-1-[1-(phenylsulfonyl)-5-(3-thienyl)-1H-py...)
Affinity DataIC50:  4.20nM. Assay description: According to the method [Biochem. Biophys. Acta., 728, 31 (1983)] of Wallmark et al., a gastric mucous membrane microsomal fraction was prepared from...
Ligand InfoPC cidPC sid
In DepthDetails US Patent