BDBM394386 N-Methyl-1-[5-phenyl-1-(3-thienylsulfonyl)-1H-pyrrol-3-yl]methanamine::US10308605, Example 43
SMILES CNCc1cc(-c2ccccc2)n(c1)S(=O)(=O)c1ccsc1
InChI Key InChIKey=UKKZWIUAZVOBNP-UHFFFAOYSA-N
Data  1 IC50
  Tab Delimited (TSV)   2D SDfile   Computed 3D by Vconf -m prep SDfile
Find this compound or compounds like it in BindingDB:
Activity Spreadsheet -- Enzyme Inhibition Constant Data from BindingDB
Found 1 hit for monomerid = 394386
TargetPotassium-transporting ATPase alpha chain 1(Sus scrofa (Pig))
Takeda Pharmaceutical
US Patent
LigandPNGBDBM394386(N-Methyl-1-[5-phenyl-1-(3-thienylsulfonyl)-1H-pyrr...)
Affinity DataIC50:  51nM. Assay description: According to the method [Biochem. Biophys. Acta., 728, 31 (1983)] of Wallmark et al., a gastric mucous membrane microsomal fraction was prepared from...
Ligand InfoPC cidPC sid
In DepthDetails US Patent