BDBM39596 2-[[4-ethyl-5-(2-methoxyphenyl)-1,2,4-triazol-3-yl]sulfanylmethyl]-1H-benzimidazole::2-[[[4-ethyl-5-(2-methoxyphenyl)-1,2,4-triazol-3-yl]thio]methyl]-1H-benzimidazole::MLS000083108::SMR000046462::cid_665365
SMILES CCn1c(SCc2nc3ccccc3[nH]2)nnc1-c1ccccc1OC
InChI Key InChIKey=FQIZQPFHDUAPAR-UHFFFAOYSA-N
Data  1 IC50  1 EC50
  Tab Delimited (TSV)   2D SDfile   Computed 3D by Vconf -m prep SDfile
Find this compound or compounds like it in BindingDB:
Activity Spreadsheet -- Enzyme Inhibition Constant Data from BindingDB
Found 2 hits for monomerid = 39596
TargetAlkaline phosphatase, germ cell type(Homo sapiens (Human))
Burnham Center For Chemical Genomics
Curated by PubChem BioAssay
LigandPNGBDBM39596(2-[[4-ethyl-5-(2-methoxyphenyl)-1,2,4-triazol-3-yl...)
Affinity DataEC50:  9.99E+5nM. Assay description: Sanford-Burnham Center for Chemical Genomics (SBCCG) Sanford-Burnham Medical Research Institute (SBMRI, San Diego, CA) NIH Molecular Libraries Screen...
In DepthDetails PCBioAssay
TargetAlkaline phosphatase, germ cell type(Homo sapiens (Human))
Burnham Center For Chemical Genomics
Curated by PubChem BioAssay
LigandPNGBDBM39596(2-[[4-ethyl-5-(2-methoxyphenyl)-1,2,4-triazol-3-yl...)
Affinity DataIC50:  9.99E+5nM. Assay description: Sanford-Burnham Center for Chemical Genomics (SBCCG) Sanford-Burnham Medical Research Institute (SBMRI, San Diego, CA) NIH Molecular Libraries Screen...
In DepthDetails PCBioAssay