BDBM39646 2-(4-benzoylphenyl)-2-(4-fluorophenyl)acetonitrile::2-(4-fluorophenyl)-2-[4-(phenylcarbonyl)phenyl]ethanenitrile::MLS000539969::SMR000125427::cid_2737783
SMILES Fc1ccc(cc1)C(C#N)c1ccc(cc1)C(=O)c1ccccc1
InChI Key InChIKey=AASRCBKEVNIKNS-UHFFFAOYSA-N
Data  1 IC50  1 EC50
  Tab Delimited (TSV)   2D SDfile   Computed 3D by Vconf -m prep SDfile
Find this compound or compounds like it in BindingDB:
Activity Spreadsheet -- Enzyme Inhibition Constant Data from BindingDB
Found 2 hits for monomerid = 39646
TargetAlkaline phosphatase, germ cell type(Homo sapiens (Human))
Burnham Center For Chemical Genomics
Curated by PubChem BioAssay
LigandPNGBDBM39646(2-(4-benzoylphenyl)-2-(4-fluorophenyl)acetonitrile...)
Affinity DataEC50:  7.89E+3nM. Assay description: Sanford-Burnham Center for Chemical Genomics (SBCCG) Sanford-Burnham Medical Research Institute (SBMRI, San Diego, CA) NIH Molecular Libraries Screen...
In DepthDetails PCBioAssay
TargetAlkaline phosphatase, germ cell type(Homo sapiens (Human))
Burnham Center For Chemical Genomics
Curated by PubChem BioAssay
LigandPNGBDBM39646(2-(4-benzoylphenyl)-2-(4-fluorophenyl)acetonitrile...)
Affinity DataIC50:  9.99E+5nM. Assay description: Sanford-Burnham Center for Chemical Genomics (SBCCG) Sanford-Burnham Medical Research Institute (SBMRI, San Diego, CA) NIH Molecular Libraries Screen...
In DepthDetails PCBioAssay