BDBM397913 US9994552, Compound 124
SMILES COc1cc2ncnc(N3CCN(CC3)c3ncc(Cc4ccccc4)c(N)n3)c2cc1OC[C@@H]1CCCN(C)C1
InChI Key InChIKey=ZRJPBKCNWMKMOM-HSZRJFAPSA-N
Data  2 IC50
  Tab Delimited (TSV)   2D SDfile   Computed 3D by Vconf -m prep SDfile
Find this compound or compounds like it in BindingDB:
Activity Spreadsheet -- Enzyme Inhibition Constant Data from BindingDB
Found 2 hits for monomerid = 397913
TargetMast/stem cell growth factor receptor Kit [D816V](Homo sapiens (Human))
Blueprint Medicines
US Patent
LigandPNGBDBM397913(US9994552, Compound 124)
Affinity DataIC50: <1nM. Assay description: Kit D816V assay: In each well of a 384-well plate, 0.04 ng/ul (0.5 nM) of D816V Kit (Carna Bioscience 08-156) was incubated in a total of 12.5 ul of ...
Ligand InfoPC cidPC sid
In DepthDetails US Patent
TargetMast/stem cell growth factor receptor Kit(Homo sapiens (Human))
Blueprint Medicines
US Patent
LigandPNGBDBM397913(US9994552, Compound 124)
Affinity DataIC50: <1nM. Assay description: Kit wild type assay: In each well of a 384-well plate, 0.2 ng/ul final (2 nM) of wild type Kit (Carna Bioscience 08-156) was incubated in a total of ...
Ligand InfoPC cidPC sid
In DepthDetails US Patent