BDBM40071 5-bromanyl-N-[2-(2-fluorophenyl)-1,3-benzoxazol-5-yl]pyridine-3-carboxamide::5-bromo-N-[2-(2-fluorophenyl)-1,3-benzoxazol-5-yl]-3-pyridinecarboxamide::5-bromo-N-[2-(2-fluorophenyl)-1,3-benzoxazol-5-yl]nicotinamide::5-bromo-N-[2-(2-fluorophenyl)-1,3-benzoxazol-5-yl]pyridine-3-carboxamide::MLS000050529::SMR000076474::cid_1295289
SMILES Fc1ccccc1-c1nc2cc(NC(=O)c3cncc(Br)c3)ccc2o1
InChI Key InChIKey=BIFACVPLICYREH-UHFFFAOYSA-N
Data  1 IC50
  Tab Delimited (TSV)   2D SDfile   Computed 3D by Vconf -m prep SDfile
Find this compound or compounds like it in BindingDB:
Activity Spreadsheet -- Enzyme Inhibition Constant Data from BindingDB
Found 1 hit for monomerid = 40071
TargetEstrogen receptor(Homo sapiens (Human))
Emory University
Curated by PubChem BioAssay
LigandPNGBDBM40071(5-bromanyl-N-[2-(2-fluorophenyl)-1,3-benzoxazol-5-...)
Affinity DataIC50:  1.55E+4nM. Assay description: NIH Molecular Libraries Screening Centers Network [MLSCN] Emory Chemical Biology Discovery Center in MLSCN Assay provider: John A. Katzenellenbogen, ...
In DepthDetails PCBioAssay