BDBM40087 2-methylsulfanylethyl 6-(furan-2-yl)-3-methyl-4-oxidanylidene-1,5,6,7-tetrahydroindole-2-carboxylate::2-methylsulfanylethyl 6-(furan-2-yl)-3-methyl-4-oxo-1,5,6,7-tetrahydroindole-2-carboxylate::6-(2-furanyl)-3-methyl-4-oxo-1,5,6,7-tetrahydroindole-2-carboxylic acid 2-(methylthio)ethyl ester::6-(2-furyl)-4-keto-3-methyl-1,5,6,7-tetrahydroindole-2-carboxylic acid 2-(methylthio)ethyl ester::MLS000116518::SMR000093488::cid_3162305
SMILES CSCCOC(=O)c1[nH]c2CC(CC(=O)c2c1C)c1ccco1
InChI Key InChIKey=YMSKQRDFWGXKSR-UHFFFAOYSA-N
Data  2 IC50
  Tab Delimited (TSV)   2D SDfile   Computed 3D by Vconf -m prep SDfile
Find this compound or compounds like it in BindingDB:
Activity Spreadsheet -- Enzyme Inhibition Constant Data from BindingDB
Found 2 hits for monomerid = 40087
TargetEstrogen receptor beta(Homo sapiens (Human))
Emory University
Curated by PubChem BioAssay
LigandPNGBDBM40087(2-methylsulfanylethyl 6-(furan-2-yl)-3-methyl-4-ox...)
Affinity DataIC50:  5.00E+4nM. Assay description: NIH Molecular Libraries Screening Centers Network [MLSCN] Emory Chemical Biology Discovery Center in MLSCN Assay provider: John A. Katzenellenbogen, ...
In DepthDetails PCBioAssay
TargetEstrogen receptor(Homo sapiens (Human))
Emory University
Curated by PubChem BioAssay
LigandPNGBDBM40087(2-methylsulfanylethyl 6-(furan-2-yl)-3-methyl-4-ox...)
Affinity DataIC50: >5.00E+4nM. Assay description: NIH Molecular Libraries Screening Centers Network [MLSCN] Emory Chemical Biology Discovery Center in MLSCN Assay provider: John A. Katzenellenbogen, ...
In DepthDetails PCBioAssay