BDBM40121 4-(2-carbamoylanilino)-4-keto-butyric acid ethyl ester::4-(2-carbamoylanilino)-4-oxobutanoic acid ethyl ester::MLS000111287::SMR000107213::cid_1789210::ethyl 4-(2-carbamoylanilino)-4-oxobutanoate::ethyl 4-[(2-aminocarbonylphenyl)amino]-4-oxidanylidene-butanoate
SMILES CCOC(=O)CCC(=O)Nc1ccccc1C(N)=O
InChI Key InChIKey=YSOVETZXAKQVLL-UHFFFAOYSA-N
Data  1 IC50
  Tab Delimited (TSV)   2D SDfile   Computed 3D by Vconf -m prep SDfile
Find this compound or compounds like it in BindingDB:
Activity Spreadsheet -- Enzyme Inhibition Constant Data from BindingDB
Found 1 hit for monomerid = 40121
TargetEstrogen receptor(Homo sapiens (Human))
Emory University
Curated by PubChem BioAssay
LigandPNGBDBM40121(4-(2-carbamoylanilino)-4-keto-butyric acid ethyl e...)
Affinity DataIC50: >5.00E+4nM. Assay description: NIH Molecular Libraries Screening Centers Network [MLSCN] Emory Chemical Biology Discovery Center in MLSCN Assay provider: John A. Katzenellenbogen, ...
In DepthDetails PCBioAssay