BDBM401230 7-[[(3S)-3-Aminopiperidin-1-yl]methyl]-3-[(5-chloro-2-ethylsulfonylphenyl)methyl]-6-(trifluoromethyl)quinazolin-4-one::US10005739, Example 690
SMILES CCS(=O)(=O)c1ccc(Cl)cc1Cn1cnc2cc(CN3CCC[C@H](N)C3)c(cc2c1=O)C(F)(F)F
InChI Key InChIKey=VNRTXXUUXKHRLE-SFHVURJKSA-N
Data  1 IC50
  Tab Delimited (TSV)   2D SDfile   Computed 3D by Vconf -m prep SDfile
Find this compound or compounds like it in BindingDB:
Activity Spreadsheet -- Enzyme Inhibition Constant Data from BindingDB
Found 1 hit for monomerid = 401230
TargetEpithelial discoidin domain-containing receptor 1(Homo sapiens (Human))
Chugai Seiyaku Kabushiki Kaisha
US Patent
LigandPNGBDBM401230(7-[[(3S)-3-Aminopiperidin-1-yl]methyl]-3-[(5-chlor...)
Affinity DataIC50:  13nM. Assay description: DDR1 binding activity was measured using the LanthaScreen (Registered trademark) Eu Kinase Binding Assay (manufactured by Life Technologies Corporati...
Ligand InfoPC cidPC sid
In DepthDetails US Patent