BDBM40187 4-methyl-N-[(5-nitro-2-thienyl)methyleneamino]benzamide::4-methyl-N-[(5-nitro-2-thiophenyl)methylideneamino]benzamide::4-methyl-N-[(5-nitrothiophen-2-yl)methylideneamino]benzamide::MLS000519463::SMR000129882::cid_689799
SMILES Cc1ccc(cc1)C(=O)N\N=C\c1ccc(s1)[N+]([O-])=O
InChI Key InChIKey=LJGPYHAVJULZAE-RIYZIHGNSA-N
Data  1 IC50  4 EC50
  Tab Delimited (TSV)   2D SDfile   Computed 3D by Vconf -m prep SDfile
Find this compound or compounds like it in BindingDB:
Activity Spreadsheet -- Enzyme Inhibition Constant Data from BindingDB
Found 5 hits for monomerid = 40187
TargetEstrogen receptor(Homo sapiens (Human))
Emory University
Curated by PubChem BioAssay
LigandPNGBDBM40187(4-methyl-N-[(5-nitro-2-thienyl)methyleneamino]benz...)
Affinity DataIC50:  2.11E+4nM. Assay description: NIH Molecular Libraries Screening Centers Network [MLSCN] Emory Chemical Biology Discovery Center in MLSCN Assay provider: John A. Katzenellenbogen, ...
In DepthDetails PCBioAssay
TargetEstrogen receptor beta(Homo sapiens (Human))
Nmmlsc
Curated by PubChem BioAssay
LigandPNGBDBM40187(4-methyl-N-[(5-nitro-2-thienyl)methyleneamino]benz...)
Affinity DataEC50:  70.7nM. Assay description: University of New Mexico Assay Overview: Assay Support: 1X01 MH077627-01 Assay for Ligands of GPR30 and Classical Estrogen Receptors PI: Eric Prossni...
In DepthDetails PCBioAssay
TargetHeat shock factor protein 1(Mus musculus)
Broad Institute
Curated by PubChem BioAssay
LigandPNGBDBM40187(4-methyl-N-[(5-nitro-2-thienyl)methyleneamino]benz...)
Affinity DataEC50:  324nM. Assay description: Keywords: Heat Shock Factor-1 (HSF-1), Stress Response, MG132, NIH3T3, Luminescence Assay Overview: Modified NIH3T3, transformed to express firefly...
In DepthDetails PCBioAssay
TargetStreptokinase A(Streptococcus pyogenes M1 GAS)
Broad Institute
Curated by PubChem BioAssay
LigandPNGBDBM40187(4-methyl-N-[(5-nitro-2-thienyl)methyleneamino]benz...)
Affinity DataEC50:  1.50E+5nM. Assay description: Keywords: Group A streptococcus, GAS, streptokinase, expression, virulence, inhibition, dose response, EC50 Assay Overview: The goal of this assa...
In DepthDetails PCBioAssay
TargetMatrix metalloproteinase-14 [1-36](Homo sapiens (Human))
Sanford-Burnham Center For Chemical Genomics
Curated by PubChem BioAssay
LigandPNGBDBM40187(4-methyl-N-[(5-nitro-2-thienyl)methyleneamino]benz...)
Affinity DataEC50:  300nM. Assay description: Data Source: Sanford-Burnham Center for Chemical Genomics (SBCCG) Source Affiliation: Sanford-Burnham Medical Research Institute (SBMRI, San Diego, C...
In DepthDetails PCBioAssay