BDBM4023 5-bromo-2-{[5-bromo-1-methyl-3-(phenylcarbamoyl)-1H-indol-2-yl]disulfanyl}-1-methyl-N-phenyl-1H-indole-3-carboxamide::dithiobis(1H-indole-3-carboxamide) deriv. 10h
SMILES Cn1c(SSc2c(C(=O)Nc3ccccc3)c3cc(Br)ccc3n2C)c(C(=O)Nc2ccccc2)c2cc(Br)ccc12
InChI Key InChIKey=GCAJVGAKBPOEBH-UHFFFAOYSA-N
Data  2 IC50
  Tab Delimited (TSV)   2D SDfile   Computed 3D by Vconf -m prep SDfile
Find this compound or compounds like it in BindingDB:
Activity Spreadsheet -- Enzyme Inhibition Constant Data from BindingDB
Found 2 hits for monomerid = 4023
TargetTyrosine-protein kinase transforming protein Src(Avian sarcoma virus)
University Of Auckland
LigandPNGBDBM4023(5-bromo-2-{[5-bromo-1-methyl-3-(phenylcarbamoyl)-1...)
Affinity DataIC50:  1.00E+5nMpH: 7.5 T: 2°C. Assay description: IC50 is the inhibitor concentration which inhibits 50% of kinase activity that catalyzes the transfer of the terminal phosphate from [gamma-32P] labe...
In DepthDetails ArticlePubMed
TargetEpidermal growth factor receptor(Homo sapiens (Human))
University Of Auckland
LigandPNGBDBM4023(5-bromo-2-{[5-bromo-1-methyl-3-(phenylcarbamoyl)-1...)
Affinity DataIC50:  1.14E+4nMpH: 7.4 T: 2°C. Assay description: IC50 is the inhibitor concentration which inhibits 50% of kinase activity that catalyzes the transfer of the terminal phosphate from [gamma-32P] labe...
In DepthDetails ArticlePubMed