BDBM403630 (3aR,7S,10S,11S,12R,24aR)-7-tert-butyl-N-[(1R,2R)-1-[(cyclopropylsulfonyl)carbamoyl]-2-(difluoromethyl)cyclopropyl]-11-ethyl-16-methoxy-3a-methyl-5,8-dioxo-1,2,3,3a,5,6,7,8,11,12,20,21,22,23,24,24a-hexadecahydro-10H-9,12-methanocyclopenta[18,19][1,10,3,6]dioxadiazacyclononadecino[11,12-b]quinoxaline-10-carboxamide::US10335409, Example 40
SMILES CC[C@@H]1[C@@H]2CN([C@@H]1C(=O)N[C@@]1(C[C@H]1C(F)F)C(=O)NS(=O)(=O)C1CC1)C(=O)[C@@H](NC(=O)O[C@]1(C)CCC[C@H]1CCCCCc1nc3ccc(OC)cc3nc1O2)C(C)(C)C
InChI Key InChIKey=VLFMHSAFMVHBEN-PAQIXKEYSA-N
Data  2 KI
  Tab Delimited (TSV)   2D SDfile   Computed 3D by Vconf -m prep SDfile
Find this compound or compounds like it in BindingDB:
Activity Spreadsheet -- Enzyme Inhibition Constant Data from BindingDB
Found 2 hits for monomerid = 403630
TargetGenome polyprotein(Hepatitis C Virus (Virus))
Gilead Pharmasset
US Patent
LigandPNGBDBM403630((3aR,7S,10S,11S,12R,24aR)-7-tert-butyl-N-[(1R,2R)-...)
Affinity DataKi:  0.0800nM. Assay description: Purified NS3 protease domain (amino acids 1-181) of the genotype 1b and 3a virus were generated as above. The internally quenched fluorogenic depsipe...
Ligand InfoPC cidPC sid
In DepthDetails US Patent
TargetGenome polyprotein(Hepatitis C virus genotype 3a (isolate k3a) (HCV))
Gilead Pharmasset
US Patent
LigandPNGBDBM403630((3aR,7S,10S,11S,12R,24aR)-7-tert-butyl-N-[(1R,2R)-...)
Affinity DataKi:  0.180nM. Assay description: Purified NS3 protease domain (amino acids 1-181) of the genotype 1b and 3a virus were generated as above. The internally quenched fluorogenic depsipe...
Ligand InfoPC cidPC sid
In DepthDetails US Patent